{"text_format":"1","workbook":"xlsx","n_sheets":6,"sheets":["Information","National details","HN NFF illustrative allocations","Individual LA","Baselines+historic spend factor","Import|export adjustments data"],"not_rendered":{"charts":2,"images":1,"macros":1,"external_links":1,"defined_names":89,"comments":0,"pivot_tables":0},"unopened":[],"bounds":{"document_bytes":16777216,"sheet_cells":100000,"rows_first":2000,"rows_last":500,"rows_between":2000,"halvings":0,"cell_chars":16384,"cell_head_chars":4096},"cells_cut":0,"cells_raw":0,"read":"whole","date_system":"1900"}

{"sheet":"Information","index":0,"n_rows":55,"n_cols":3,"rows_kept":55,"cut":false,"hidden":false,"merged":[[33,0,33,2],[13,1,13,2],[14,1,14,2],[19,1,19,2],[20,1,20,2],[32,0,32,2],[15,1,15,2],[21,1,21,2]]}
[]
[]
[]
[]
[]
[]
[]
[]
[]
["High needs national funding formula - illustrative allocations to local authorities (LAs)"]
{"$rows_left_out":46}
{"sheet":"National details","index":1,"n_rows":28,"n_cols":9,"rows_kept":28,"cut":false,"hidden":false,"merged":[[19,5,19,8],[20,5,20,8],[26,5,26,8],[27,5,27,8],[23,5,23,8],[24,5,24,8],[25,5,25,8],[21,5,21,8],[22,5,22,8],[12,1,12,3],[12,5,12,8],[16,1,16,3],[16,5,16,8],[8,5,8,8],[10,1,10,3],[10,5,10,8],[11,1,11,3],[11,5,11,8],[9,1,9,3],[9,5,9,8],[17,1,17,3],[17,5,17,8],[15,1,15,3],[15,5,15,8],[14,1,14,3],[14,5,14,8]]}
[]
[]
[null,"High needs national funding formula (HN NFF): National details"]
[null,"This page explains:",null,null,null,null,null,null,"Cell colour guide"]
[null,"- how the total national high needs funding is calculated",null,null,null,null,null,null,"Input data"]
[null,"- how the funding is distributed through the HN NFF factors",null,null,null,null,null,null,"Calculation"]
[null,null,null,null,null,null,null,null,"Explanation"]
[]
[null,null,null,null,null,"Explanation of amounts and calculations"]
[null,"LA baselines total\n[a]",null,null,5694074632.8630896,"This is the total 2016-17 baselines (which form the basis of local authorities’ 2017-18 high needs allocations), as published in July 2016. This total excludes funding for City of London and Isles of Scilly."]
{"$rows_left_out":19}
{"sheet":"HN NFF illustrative allocations","index":2,"n_rows":158,"n_cols":57,"rows_kept":158,"cut":false,"hidden":false,"merged":[[5,54,5,56],[4,53,4,56],[5,8,6,8],[5,1,6,1],[5,2,6,2],[5,3,6,3],[5,40,5,42],[5,43,5,45],[5,15,5,17],[5,18,5,20],[5,21,5,23],[5,24,5,26],[5,27,5,29],[5,30,5,32],[5,34,5,36],[5,37,5,39],[4,5,4,7],[5,53,6,53],[5,47,5,49],[5,46,6,46],[5,5,5,7],[5,9,5,11],[5,12,5,14],[5,51,5,52],[4,9,4,45]]}
[null,"High needs national funding formula - illustrative allocations to local authorities (LAs)"]
[]
[null,"Step-by-step guide for LAs to understand the calculation of the high needs block illustrative allocations"]
[]
[null,null,null,null,null,"These columns calculate the basic entitlement factor funding for each LA",null,null,null,"These columns distribute the remaining funding to LAs through the proxy factors. For each proxy factor the calculation is: for each local authority multiply the number of children by the ACA to give an ACA-weighted number of children; work out the national total of ACA-weighted children; split the total factor funding between local authorities using their proportion of the national total of ACA-weighted numbers of children.",null,null,null,null,null,null,null,null,null,null,null,null,null,null,null,null,null,null,null,null,null,null,null,null,null,null,null,null,null,null,null,null,null,null,null,null,null,null,null,null,null,null,null,"Illustrative high needs NFF allocations"]
[null,"Region","LA code","LA name",null,"(A) Basic entitlement factor",null,null,"(B) Historic spend factor (from column Q in 'Baselines+historic spend factor')\n[e]","(C) Population factor",null,null,"(D) FSM factor",null,null,"IDACI band F factor",null,null,"IDACI band E factor",null,null,"IDACI band D factor",null,null,"IDACI band C factor",null,null,"IDACI band B factor",null,null,"IDACI band A factor",null,null,"(E) IDACI factor","(F) Bad health factor",null,null,"(G) Disability factor",null,null,"(H) KS2 low attainment factor",null,null,"(I) KS4 low attainment factor",null,null,"Total historic spend and proxy factor allocation (sum of (B) - (I))\n[aq]","(J) Funding floor factor",null,null,"(K) Hospital education funding","(L) Import/export adjustment",null,"Illustrative high needs NFF final allocations\n[ax] = [d] + [aq] + [at] + [au] + [aw]","Illustrative high needs NFF year 1 allocations"]
[null,null,null,null,"Area cost adjustment ('ACA')\n\n[a]","Number of pupils in special schools/academies\n[b]","ACA-weighted basic entitlement unit rate (£4k per pupil)\n[c]","Basic entitlement factor\n[d] = [b] x [c]",null,"2018 2-18 population projection for LA\n[f]","ACA-weighted population\n[g]","Population factor\n[h] = [g]% x ND[i]","Number of FSM pupils resident in LA\n[i]","ACA-weighted FSM pupils\n[j]","FSM factor\n[k] = [i]% * ND[j]","IDACI band F population\n[l]","ACA-weighted IDACI band F population\n[m]","IDACI band F factor\n[n] = [m]% x (ND[k] x 14%)","IDACI band E population\n[o]","ACA-weighted IDACI band E population\n[p]","IDACI band E factor\n[q] = [p]% x (ND[k] x 16%)","IDACI band D population\n[r]","ACA-weighted IDACI band D population\n[s]","IDACI band D factor\n[t] = [s]% x (ND[k] x 19%)","IDACI band C population\n[u]","ACA-weighted IDACI band C population\n[v]","IDACI band C factor\n[w] = [v]% x (ND[k] x 16%)","IDACI band B population\n[x]","ACA-weighted IDACI band B population\n[y]","IDACI band B factor\n[z] = [y]% x (ND[k] x 23%)","IDACI band A population\n[aa]","ACA-weighted IDACI band A population\n[ab]","IDACI band A factor\n[ac] = [ab]% x (ND[k] x 12%)","IDACI factor\n[ad] = (ND[k]) = [n]+ [q] + [t] + [w] + [z] + [ac]","Number of children in bad health resident in LA\n[ae]","ACA-weighted number of children in bad health\n[af]","Bad health factor\n[ag] = [af]% x ND[l]","Number of children resident in LA for whom DLA claimed\n[ah]","ACA-weighted number of children for whom DLA claimed\n[ai]","Disability factor\n[aj] = [ai]% x ND[m]","Number of pupils resident in LA not attaining level 3 in KS2 reading (5 year total)\n[ak]","ACA-weighted number of pupils resident in LA not attaining level 3 in KS2 reading (5 year total)\n[al]","KS2 factor\n[am] = [al]% x ND[n]","Number of pupils resident in LA not attaining 5 GCSEs A*-G (5 year total)\n[an]","ACA-weighted number of pupils not attaining 5 GCSEs A*-G (5 year total)\n[ao]","KS4 factor\n[ap] = [ao]% x ND[o]",null,"Baseline for funding floor and year 1 gains (from column P in 'Baselines+historic spend factor')\n[ar]","Difference between historic spend/proxy factors allocation and funding floor baseline\n[as] = [aq] - [ar]","Funding floor factor\n[at]","Hospital education funding\n[au]","Net number of imported/exported pupils/students (from column Q in 'Import|export adjustments data')\n[av]","Import/export adjustments\n[aw] = [av] x £6k",null,"Total gains due under the high needs NFF\n[ay]","Year 1 gains available, up to 3%\n[az]","Illustrative high needs NFF year 1 allocations\n[ba] = [d] + [aq] + [at] + [au] + [aw] + ([az] - [ay])"]
[null,"England total",null,null,null,{"$f":"SUM(F9:F158)","v":114781},null,{"$f":"SUM(H9:H158)","v":472744600.90392452},2548694577.904212,11192790.733000007,11558351.383895544,{"$f":" 'National details'!$E$21","v":1273887288.9521058},1144662,1185416.3692706691,{"$f":" 'National details'!$E$22","v":254777457.79042116},1066262,1103198.993056244,{"$f":"14%*$AH$8","v":35668844.090658963},929550,967386.64672165201,{"$f":"16%*$AH$8","v":40764393.246467389},786227,818540.50228187977,{"$f":"19%*$AH$8","v":48407716.980180018},670459,703388.68524661823,{"$f":"16%*$AH$8","v":40764393.246467389},829630,865356.57881016855,{"$f":"23%*$AH$8","v":58598815.291796871},311358,{"$f":"SUM(AF9:AF158)","v":318345.63496741327},{"$f":"12%*$AH$8","v":30573294.934850536},{"$f":"'National details'!$E$23","v":254777457.79042116},64495,66812.283163815926,{"$f":"'National details'!$E$24","v":191083093.34281585},357750,367701.25207322813,{"$f":"'National details'!$E$25","v":191083093.34281585},142518,146266.66098687684,{"$f":"'National details'!$E$26","v":191083093.34281585},138620,141997.67657803281,{"$f":"'National details'!$E$27","v":191083093.34281585},5096469155.8084221,5097389155.808424,null,null,{"$f":"SUM(AY9:AY158)","v":72649416.215833336},-6764,-40584000,{"$f":"SUM(BB9:BB158)","v":5792243453.155551},null,null,5667950675.7614651]
[{"$f":"IFERROR(INDEX($D$9:$D$158,MATCH(ROW(INDIRECT(\"1:\"&ROWS($D$9:$D$158)))-1,COUNTIF($D$9:$D$158,\"<\" & $D$9:$D$158),0)),\"\")","v":"Barking and Dagenham"},"EAST MIDLANDS ",831,"Derby",1,659,{"$f":"4000 * E9","v":4000},{"$f":"F9*G9","v":2636000},{"$f":"INDEX('Baselines+historic spend factor'!$Q$9:$Q$158, MATCH('HN NFF illustrative allocations'!$C9, 'Baselines+historic spend factor'!$C$9:$C$158, 0))","v":15416973.61945878},55748.5,{"$f":"J9 * E9","v":55748.5},{"$f":" (K9 /$K$8) * L$8","v":6144241.7840918154},6887,{"$f":"M9 * E9","v":6887},{"$f":" (N9 /N$8) * O$8","v":1480199.1918520457},5421,{"$f":"P9 * E9","v":5421},{"$f":"(Q9/Q$8)*R$8","v":175272.82478729039},4587,{"$f":"S9 * E9","v":4587},{"$f":"(T9/T$8)*U$8","v":193290.11047983571},5168,{"$f":"V9 * E9","v":5168},{"$f":"(W9/W$8)*X$8","v":305630.66904589068},6448,{"$f":"Y9 * E9","v":6448},{"$f":"(Z9/Z$8)*AA$8","v":373689.27474439418},7995,{"$f":"AB9 * E9","v":7995},{"$f":"(AC9/AC$8)*AD$8","v":541392.46147765091},2730,{"$f":"AE9 * E9","v":2730},{"$f":"(AF9/AF$8)*AG$8","v":262183.88444586552},{"$f":"R9+U9+X9+AA9+AD9+AG9","v":1851459.2249809275},341,{"$f":"AI9 * E9","v":341},{"$f":"(AJ9/AJ$8)*AK$8","v":975259.81368032459},1990,{"$f":"AL9 * E9","v":1990},{"$f":" (AM9 / $AM$8) * 'National details'!$E$25","v":1034142.1292644258},1051,{"$f":"AO9 * E9","v":1051},{"$f":" (AP9 / $AP$8) * 'National details'!$E$26","v":1373028.7527471343},815,{"$f":"AR9 * E9","v":815},{"$f":"(AS9/AS$8) *'National details'!$E$27","v":1096727.2481308114},{"$f":"I9+L9+O9+AH9+AK9+AN9+AQ9+AT9","v":29372031.76420626},{"$f":"INDEX('Baselines+historic spend factor'!$P$9:$P$158, MATCH($C9, 'Baselines+historic spend factor'!$C$9:$C$158, 0))","v":30833947.238917559},{"$f":"AU9-AV9","v":-1461915.4747112989},{"$f":"MAX(0, -AW9)","v":1461915.4747112989},239371,{"$f":"INDEX('Import|export adjustments data'!$Q$9:$Q$158, MATCH($C9, 'Import|export adjustments data'!$C$9:$C$158, 0))","v":-31},{"$f":"AZ9 * 6000","v":-186000},{"$f":"H9+AU9+AX9+AY9+BA9","v":33523318.238917559},{"$f":"MAX(AW9, 0)","v":0},{"$f":"MIN(BC9, 3% * AV9)","v":0},{"$f":"H9+AU9+AX9+AY9+BA9+(BD9-BC9)","v":33523318.238917559}]
["Barnet","EAST MIDLANDS ",830,"Derbyshire",1,978,4000,3912000,{"$f":"INDEX('Baselines+historic spend factor'!$Q$9:$Q$158, MATCH('HN NFF illustrative allocations'!$C10, 'Baselines+historic spend factor'!$C$9:$C$158, 0))","v":32292934.072600305},145476.11500000002,145476.11500000002,16033443.489427453,13406,13406,2881305.411059754,15381,15381,497301.47907273815,7658,7658,322697.98693145451,8798,8798,520305.46173872799,8162,8162,473022.93121336005,8035,8035,544101.1166945498,765,765,73469.110476588685,2430898.086127419,670,670,1916199.6339173533,4840,4840,{"$f":" (AM10 / $AM$8) * 'National details'!$E$25","v":2515199.9525828245},1660,1660,{"$f":" (AP10 / $AP$8) * 'National details'!$E$26","v":2168627.7160420963},1951,1951,{"$f":"(AS10/AS$8) *'National details'!$E$27","v":2625417.0074886051},62864025.369245812,{"$f":"INDEX('Baselines+historic spend factor'!$P$9:$P$158, MATCH($C10, 'Baselines+historic spend factor'!$C$9:$C$158, 0))","v":64585868.14520061},-1721842.7759547979,1721842.7759547979,50000,{"$f":"INDEX('Import|export adjustments data'!$Q$9:$Q$158, MATCH($C10, 'Import|export adjustments data'!$C$9:$C$158, 0))","v":-241},-1446000,{"$f":"H10+AU10+AX10+AY10+BA10","v":67101868.14520061},0,0,{"$f":"H10+AU10+AX10+AY10+BA10+(BD10-BC10)","v":67101868.14520061}]
{"$rows_left_out":149}
{"sheet":"Individual LA","index":3,"n_rows":161,"n_cols":18,"rows_kept":161,"cut":false,"hidden":false,"merged":[[29,5,31,5],[96,4,98,4],[96,8,98,8],[96,9,98,9],[96,10,98,10],[88,4,90,4],[88,8,90,8],[88,9,90,9],[146,8,146,9],[80,4,82,4],[80,8,82,8],[80,9,82,9],[80,10,82,10],[72,4,74,4],[72,8,74,8],[72,9,74,9],[72,10,74,10],[64,8,66,8],[64,9,66,9],[64,10,66,10],[150,8,150,9],[88,10,90,10],[144,2,150,2],[130,4,132,4],[130,8,132,8],[130,9,132,9],[130,10,132,10],[118,9,120,9],[118,10,120,10],[130,12,132,12],[131,5,131,7],[132,5,132,7],[126,9,128,9],[126,10,128,10],[126,11,128,11],[126,12,128,12],[127,5,127,7],[122,4,124,4],[122,8,124,8],[122,9,124,9],[122,10,124,10],[122,12,124,12],[123,5,123,7],[124,5,124,7],[130,11,132,11],[122,11,124,11],[118,12,120,12],[119,5,119,7],[114,4,116,4],[114,8,116,8],[114,9,116,9],[114,10,116,10],[114,12,116,12],[115,5,115,7],[116,5,116,7],[114,11,116,11],[118,11,120,11],[110,12,112,12],[111,5,111,7],[106,4,108,4],[106,8,108,8],[106,12,108,12],[107,5,107,7],[108,5,108,7],[102,9,104,9],[103,5,103,7],[106,9,108,9],[106,10,108,10],[106,11,108,11],[102,10,104,10],[102,11,104,11],[102,12,104,12],[110,9,112,9],[110,10,112,10],[110,11,112,11],[96,12,98,12],[97,5,97,7],[98,5,98,7],[96,11,98,11],[92,9,94,9],[92,10,94,10],[92,11,94,11],[92,12,94,12],[93,5,93,7],[88,12,90,12],[89,5,89,7],[90,5,90,7],[88,11,90,11],[84,9,86,9],[84,10,86,10],[84,11,86,11],[84,12,86,12],[85,5,85,7],[80,12,82,12],[81,5,81,7],[82,5,82,7],[80,11,82,11],[76,9,78,9],[76,10,78,10],[76,11,78,11],[76,12,78,12],[77,5,77,7],[72,12,74,12],[73,5,73,7],[74,5,74,7],[72,11,74,11],[68,9,70,9],[68,10,70,10],[68,11,70,11],[68,12,70,12],[69,5,69,7],[64,12,66,12],[65,5,65,7],[66,5,66,7],[64,11,66,11],[60,9,62,9],[60,10,62,10],[60,11,62,11],[60,12,62,12],[61,5,61,7],[44,11,46,11],[44,12,46,12],[45,5,45,7],[56,8,58,8],[56,9,58,9],[56,10,58,10],[56,12,58,12],[57,5,57,7],[58,5,58,7],[56,11,58,11],[52,9,54,9],[52,10,54,10],[52,11,54,11],[52,12,54,12],[53,5,53,7],[21,2,23,2],[25,2,34,2],[36,2,42,2],[44,2,50,2],[52,2,58,2],[37,5,37,7],[40,12,42,12],[40,10,42,10],[40,9,42,9],[36,12,38,12],[36,11,38,11],[36,10,38,10],[36,9,38,9],[40,11,42,11],[40,8,42,8],[48,8,50,8],[48,9,50,9],[48,10,50,10],[48,12,50,12],[49,5,49,7],[50,5,50,7],[48,11,50,11],[44,9,46,9],[44,10,46,10],[154,1,160,1],[160,8,160,9],[138,8,138,9],[136,2,138,2],[154,2,160,2],[23,8,23,9],[21,8,21,9],[34,8,34,9],[31,8,31,9],[41,5,41,7],[118,2,124,2],[126,2,132,2],[68,2,74,2],[76,2,82,2],[84,2,90,2],[92,2,98,2],[102,2,108,2],[110,2,116,2],[60,2,66,2],[42,5,42,7],[40,4,42,4],[48,4,50,4],[56,4,58,4],[64,4,66,4]]}
[null,{"$f":"MATCH(F4,'HN NFF illustrative allocations'!C:C,0)","v":77}]
[null,null,"Select LA name (drop-down)",null,null,"Barking and Dagenham",null,"Area cost adjustment ('ACA')"]
[null,null,"Region",null,null,{"$f":"INDEX('HN NFF illustrative allocations'!$B$9:$B$158, MATCH(F2,'HN NFF illustrative allocations'!$D$9:$D$158,0))","v":"OUTER LONDON "},null,{"$f":"INDEX('HN NFF illustrative allocations'!E:E,B1)","v":1.123376795120447}]
[null,null,"LA code",null,null,{"$f":"INDEX('HN NFF illustrative allocations'!$C$9:$C$158, MATCH(F2,'HN NFF illustrative allocations'!$D$9:$D$158,0))","v":301}]
[]
[null,null,{"$f":"HYPERLINK(\"#\"& CELL(\"address\",C22),C22 &\" (\"&100*ROUND(F6/$F$17,2)&\"%)\")","v":"(A) Basic entitlement factor (5%)"},null,null,{"$f":"INDEX('HN NFF illustrative allocations'!H:H,$B$1)","v":1464883.3408370628},null,null,null,null,{"$f":"\"Formula split for \" & F2","v":"Formula split for Barking and Dagenham"}]
[null,null,{"$f":"HYPERLINK(\"#\"& CELL(\"address\",C26),C26 & \" (\" & 100*ROUND(F7/$F$17, 2) & \"%)\")","v":"(B) Historic spend factor (40%)"},null,null,{"$f":"INDEX('HN NFF illustrative allocations'!I:I,$B$1)","v":11894872.403572906},null,null,null,null,null,null,null,"Average LA formula split"]
[null,null,{"$f":"HYPERLINK(\"#\"& CELL(\"address\",C37),C37 & \" (\" & 100*ROUND(F8/$F$17, 2) & \"%)\")","v":"(C) Population factor (24%)"},null,null,{"$f":"INDEX('HN NFF illustrative allocations'!L:L,$B$1)","v":7361485.2088078763},null,null,null,null,null,null,null,"(A) Basic entitlement factor",null,null,{"$f":"N8 &\" (\" & 100*ROUND(R8,2)&\"%)\"","v":"(A) Basic entitlement factor (8%)"},{"$f":"'HN NFF illustrative allocations'!H$8/'HN NFF illustrative allocations'!$BB$8","v":8.1616838920397658E-2}]
[null,null,{"$f":"HYPERLINK(\"#\"& CELL(\"address\",C45),C45 & \" (\" & 100*ROUND(F9/$F$17, 2) & \"%)\")","v":"(D) FSM factor (7%)"},null,null,{"$f":"INDEX('HN NFF illustrative allocations'!O:O,$B$1)","v":1959072.6058703694},null,null,null,null,null,null,null,"(B) historic factor",null,null,{"$f":"N9 &\" (\" & 100*ROUND(R9,2)&\"%)\"","v":"(B) historic factor (44%)"},{"$f":"'HN NFF illustrative allocations'!I$8/'HN NFF illustrative allocations'!$BB$8","v":0.44001855214074453}]
[null,null,{"$f":"HYPERLINK(\"#\"& CELL(\"address\",C101),C101 & \" (\" & 100*ROUND(F10/$F$17, 2) & \"%)\")","v":"(E) IDACI factor (10%)"},null,null,{"$f":"INDEX('HN NFF illustrative allocations'!AH:AH,$B$1)","v":2955391.0978457187},null,null,null,null,null,null,null,"(C) population factor",null,null,"(C) population factor (22%)",{"$f":"'HN NFF illustrative allocations'!L$8/'HN NFF illustrative allocations'!$BB$8","v":0.21992985951895822}]
{"$rows_left_out":152}
{"sheet":"Baselines+historic spend factor","index":4,"n_rows":158,"n_cols":17,"rows_kept":158,"cut":false,"hidden":false,"merged":[[5,15,6,15],[5,16,6,16],[5,1,6,1],[5,2,6,2],[5,3,6,3],[5,11,5,14],[5,10,6,10],[5,6,6,6],[5,7,5,9],[5,4,6,4],[5,5,6,5]]}
[null,"High needs national funding formula - illustrative allocations to local authorities (LAs)"]
[]
[null,"Step-by-step guide for LAs to understand the calculation of the high needs block illustrative allocations"]
[]
[null,"These columns set out identifying information for LAs",null,null,"This is a geographical cost adjustment",null,"The totals columns are all subtracted from the baseline funding"]
[null,"Region","LA code","LA name","Area cost adjustment (ACA)\n[a]","(B)[i] Published LA baseline after adjustments\n[b]","(B)[ii] Schools block transfer to reflect funding change for special units\n[c]","(B)[iii] Baseline year basic entitlement",null,null,"(B)[iv] Baseline year hospital education funding\n[g]","(B)[v] Baseline year import/export adjustment",null,null,null,"(B)[vi] Funding floor and year 1 gains baseline\n[l] = [b] - [c] - [f] - [g] - [k]","(B) Historic spend factor\n[m] = 50% x [l]"]
[null,null,null,null,null,null,null,"Number of pupils in special schools/academies\n[d]","ACA-weighted basic entitlement unit rate (£4k per pupil)\n[e]","Baseline year basic entitlement\n[f] = [d] x [e]",null,"Provider LA\n[h]","Resident LA\n[i]","Net imported/exported pupils\n[j] = [h] - [i]","Baseline year import/export adjustment\n[k] = [j] x £6k"]
[null,"England total",null,null,null,{"$f":"SUM(F9:F158)","v":5694074632.8630896},{"$f":"SUM(G9:G158)","v":91875459.93490757},{"$f":"SUM(H9:H158)","v":114781},null,{"$f":"SUM(J9:J158)","v":472744600.90392452},72649416.215833336,223631,230395,-6764,-40584000,{"$f":"SUM(P9:P158)","v":5097389155.808424},{"$f":"SUM(Q9:Q158)","v":2548694577.904212}]
[null,"EAST MIDLANDS ",831,"Derby",1,34577000,1053681.7610824406,659,{"$f":"4000 * E9","v":4000},{"$f":"H9*I9","v":2636000},239371,{"$f":"INDEX('Import|export adjustments data'!$P$9:$P$158, MATCH($C9, 'Import|export adjustments data'!$C$9:$C$158, 0))","v":1160},{"$f":"INDEX('Import|export adjustments data'!$K$9:$K$158, MATCH($C9, 'Import|export adjustments data'!$C$9:$C$158, 0))","v":1191},{"$f":"L9-M9","v":-31},{"$f":"N9 * 6000","v":-186000},{"$f":"F9 - SUM(K9,O9,G9,J9)","v":30833947.238917559},{"$f":"P9*0.5","v":15416973.61945878}]
[null,"EAST MIDLANDS ",830,"Derbyshire",1,68153000,1051131.8547993898,978,4000,3912000,50000,{"$f":"INDEX('Import|export adjustments data'!$P$9:$P$158, MATCH($C10, 'Import|export adjustments data'!$C$9:$C$158, 0))","v":2876},{"$f":"INDEX('Import|export adjustments data'!$K$9:$K$158, MATCH($C10, 'Import|export adjustments data'!$C$9:$C$158, 0))","v":3117},-241,-1446000,64585868.14520061,32292934.072600305]
{"$rows_left_out":149}
{"sheet":"Import|export adjustments data","index":5,"n_rows":158,"n_cols":17,"rows_kept":158,"cut":false,"hidden":false,"merged":[[4,11,4,14],[5,16,6,16],[5,15,6,15],[5,10,6,10],[5,8,6,8],[5,9,6,9],[5,13,6,13],[5,14,6,14],[5,11,6,11],[5,12,6,12],[5,5,6,5],[4,8,4,9],[5,1,6,1],[5,2,6,2],[5,3,6,3],[4,4,4,7],[5,6,6,6],[5,7,6,7],[5,4,6,4]]}
[null,"High needs national funding formula - illustrative allocations to local authorities (LAs)"]
[]
[null,"Step-by-step guide for LAs to understand the calculation of the high needs block illustrative allocations"]
[]
[null,"These columns set out identifying information for LAs",null,null,"Split of pupils/students in special schools and academies, or for whom top-up funding is paid, by LA in which they are resident",null,null,null,"Pupils/students in NMSSs or SPIs by LA in which they are resident",null,null,"Split of pupils/students in special schools and academies, or for whom top-up funding is paid, by LA which hosts the provider"]
[null,"Region","LA code","LA name","Maintained special school pupil numbers by resident LA\n[a]","Special academy pupil numbers by resident LA\n[b]","Pupils numbers for whom top-up funding is paid to mainstream schools, by resident LA\n[c]","Student numbers for whom top-up funding is paid to FE institutions, by resident LA\n[d]","NMSS pupil numbers by resident LA\n[e]","SPI student numbers by resident LA\n[f]","Total of specialist and mainstream provider pupil/student numbers split by resident LA\n[g] = [a] + [b] + [c] + [d] + [e] + [f]","Maintained special school pupil numbers by provider LA\n[h]","Special academy pupil numbers by provider LA\n[i]","Pupils numbers for whom top-up funding is paid to mainstream schools, by provider LA\n[j]","Student numbers for whom top-up funding is paid to FE institutions, by provider LA\n[k]","Total of specialist and mainstream provider pupil/student numbers split by provider LA\n[l] = [h] + [i] + [j] + [k]","Net imported/exported pupils\n[m] = [l] - [g]"]
[]
[null,"England total",null,null,{"$f":"SUM(E9:E158)","v":82529},20486,101662,18951,3736,3031,230395,82531,{"$f":"SUM(M9:M158)","v":20486},101663,18951,223631,-6764]
[null,"EAST MIDLANDS ",831,"Derby",624,1,391,105,61,9,{"$f":"SUM(E9:J9)","v":1191},597,0,392,171,{"$f":"SUM(L9:O9)","v":1160},{"$f":"P9 - K9","v":-31}]
[null,"EAST MIDLANDS ",830,"Derbyshire",909,13,1913,196,40,46,3117,885,0,1917,74,2876,-241]
{"$rows_left_out":148}