{"text_format":"1","workbook":"xlsx","n_sheets":9,"sheets":["Instructions","Overview","Impacts","Annuity Rate","EANCB Calculations","EANCB Formulae","Ventilation","Fume Cupboard costs","Ventilation detail costs "],"not_rendered":{"charts":0,"images":4,"macros":0,"external_links":1,"defined_names":3,"comments":0,"pivot_tables":0},"unopened":[],"bounds":{"document_bytes":16777216,"sheet_cells":100000,"rows_first":2000,"rows_last":500,"rows_between":2000,"halvings":0,"cell_chars":16384,"cell_head_chars":4096},"cells_cut":0,"cells_raw":0,"read":"whole","date_system":"1900"}

{"sheet":"Instructions","index":0,"n_rows":47,"n_cols":2,"rows_kept":47,"cut":false,"hidden":false,"merged":[[0,1,2,4],[37,1,37,2],[7,1,9,4],[14,1,14,4],[21,1,21,4],[34,1,34,4],[4,1,5,4],[43,1,45,4],[25,1,27,4],[28,1,30,4],[46,1,46,4],[39,1,40,4],[41,1,41,4]]}
[null,"Business Engagement  Assessment Calculator"]
[]
[]
[]
[null,"1. As set out in the 'Accountability for Regulator Impact' (ARI) Guidance, when producing a 'Business Engagement Assessment' (BEA) regulators are required to produce an estimate of the 'Equivalent Annual Net Cost to Business' (EANCB) that results from the change(s) that they are intending to make. "]
[]
[]
[null,"2. This calculator can be used to easily calculate the present values and EANCB figures that are required to complete a Business Engagement Assessment. The use of this calculator is entirely optional - regulators can use whatever tools they wish in order to produce their impact estimates."]
[]
[]
[]
[null,"Instructions for use"]
[null,"Step 1"]
[]
[null,"3. Enter in the green table below the number of years over which the policy is being appraised."]
{"$rows_left_out":33}
{"sheet":"Overview","index":1,"n_rows":22,"n_cols":13,"rows_kept":22,"cut":false,"hidden":false,"merged":[[20,10,21,11],[89,10,89,12],[109,10,109,12],[9,10,9,12],[29,10,29,12],[49,10,49,12],[69,10,69,12],[10,10,11,11],[12,10,13,11],[10,12,11,12],[17,10,17,12],[18,10,19,11],[18,12,19,12]]}
[]
[]
[null,"BEA Title:",null,"BB101 Revision"]
[]
[null,"Overview page:"]
[]
[null,null,null,null,"Net Benefit to Business (Present Value (PV)) (£m)"]
[null,null,"Low:",{"$f":"G16-G12","v":0},"High:",{"$f":"G17-G11","v":78.515705974539102},"Best Estimate",{"$f":"G18-G13","v":-11.253987408310422}]
[]
[null,null,"Costs","Total Transition (constant price)","years","Average Annual (excl. Transition, constant price)","Total Cost           (present value)"]
[null,null,"Low",{"$f":"SUM(Impacts!$B$6:$CW$6)","v":0},null,{"$f":"SUM(Impacts!$B$99:$CW$99)/Instructions!$B$18","v":-8.0326611878399969},{"$f":"Impacts!$CX$85","v":-78.515705974539102}]
[null,null,"High",{"$f":"SUM(Impacts!$B$7:$CW$7)","v":0},null,{"$f":"SUM(Impacts!$B$100:$CW$100)/Instructions!$B$18","v":0},{"$f":"Impacts!$CX$86","v":0}]
[null,null,"Best Estimate",{"$f":"SUM(Impacts!$B$5:$CW$5)","v":84},null,{"$f":"SUM(Impacts!$B$98:$CW$98)/Instructions!$B$18","v":525.94150186752017},{"$f":"Impacts!$CX$84","v":4329.9461776940061}]
[]
[null,null,"Benefits","Total Transition (constant price)","years","Average Annual (excl. Transition, constant price)","Total Benefit      (present value)"]
{"$rows_left_out":8}
{"sheet":"Impacts","index":2,"n_rows":178,"n_cols":205,"rows_kept":178,"cut":false,"hidden":false,"merged":[]}
[null,null,null,null,null,null,null,null,null,"all figures in £1000s"]
["Year",0,1,2,3,4,5,6,7,8,9,10,11,12,13,14,15,16,17,18,19,20,21,22,23,24,25,26,27,28,29,30,31,32,33,34,35,36,37,38,39,40,41,42,43,44,45,46,47,48,49,50,51,52,53,54,55,56,57,58,59,60,61,62,63,64,65,66,67,68,69,70,71,72,73,74,75,76,77,78,79,80,81,82,83,84,85,86,87,88,89,90,91,92,93,94,95,96,97,98,99]
[]
["Transition Costs",null,null,null,null,null,null,null,null,null,null,null,null,null,null,null,null,null,null,null,null,null,null,null,null,null,null,null,null,null,null,null,null,null,null,null,null,null,null,null,null,null,null,null,null,null,null,null,null,null,null,null,null,null,null,null,null,null,null,null,null,null,null,null,null,null,null,null,null,null,null,null,null,null,null,null,null,null,null,null,null,null,null,null,null,null,null,null,null,null,null,null,null,null,null,null,null,null,null,null,null,"Nominal Total","Present Value Total"]
["Total Transition Cost",84,null,null,null,null,null,null,null,null,null,0,0,0,0,0,0,0,0,0,0,0,0,0,0,0,0,0,0,0,0,0,0,0,0,0,0,0,0,0,0,0,0,0,0,0,0,0,0,0,0,0,0,0,0,0,0,0,0,0,0,0,0,0,0,0,0,0,0,0,0,0,0,0,0,0,0,0,0,0,0,0,0,0,0,0,0,0,0,0,0,0,0,0,0,0,0,0,0,0,0,{"$f":"SUM(B5:CW5)","v":84},{"$f":"SUM(B108:CW108)","v":84},1,{"$f":"(B5*$CZ5)","v":84},{"$f":"(C5*$CZ5)","v":0},0,0,0,0,0,0,0,0,0,0,0,0,0,0,0,0,0,0,0,0,0,0,0,0,0,0,0,0,0,0,0,0,0,0,0,0,0,0,0,0,0,0,0,0,0,0,0,0,0,0,0,0,0,0,0,0,0,0,0,0,0,0,0,{"$f":"(BO5*$CZ5)","v":0},0,0,0,0,0,0,0,0,0,0,0,0,0,0,0,0,0,0,0,0,0,0,0,0,0,0,0,0,0,0,0,0,0,0]
[null,null,null,null,null,null,null,null,null,null,null,0,0,0,0,0,0,0,0,0,0,0,0,0,0,0,0,0,0,0,0,0,0,0,0,0,0,0,0,0,0,0,0,0,0,0,0,0,0,0,0,0,0,0,0,0,0,0,0,0,0,0,0,0,0,0,0,0,0,0,0,0,0,0,0,0,0,0,0,0,0,0,0,0,0,0,0,0,0,0,0,0,0,0,0,0,0,0,0,0,0,{"$f":"SUM(B6:CW6)","v":0},{"$f":"SUM(B109:CW109)","v":0},0,{"$f":"(B6*$CZ6)","v":0},{"$f":"(C6*$CZ6)","v":0},{"$f":"(D6*$CZ6)","v":0},{"$f":"(E6*$CZ6)","v":0},{"$f":"(F6*$CZ6)","v":0},{"$f":"(G6*$CZ6)","v":0},{"$f":"(H6*$CZ6)","v":0},{"$f":"(I6*$CZ6)","v":0},{"$f":"(J6*$CZ6)","v":0},{"$f":"(K6*$CZ6)","v":0},{"$f":"(L6*$CZ6)","v":0},{"$f":"(M6*$CZ6)","v":0},{"$f":"(N6*$CZ6)","v":0},{"$f":"(O6*$CZ6)","v":0},{"$f":"(P6*$CZ6)","v":0},{"$f":"(Q6*$CZ6)","v":0},{"$f":"(R6*$CZ6)","v":0},{"$f":"(S6*$CZ6)","v":0},{"$f":"(T6*$CZ6)","v":0},{"$f":"(U6*$CZ6)","v":0},{"$f":"(V6*$CZ6)","v":0},{"$f":"(W6*$CZ6)","v":0},{"$f":"(X6*$CZ6)","v":0},{"$f":"(Y6*$CZ6)","v":0},{"$f":"(Z6*$CZ6)","v":0},{"$f":"(AA6*$CZ6)","v":0},{"$f":"(AB6*$CZ6)","v":0},{"$f":"(AC6*$CZ6)","v":0},{"$f":"(AD6*$CZ6)","v":0},{"$f":"(AE6*$CZ6)","v":0},{"$f":"(AF6*$CZ6)","v":0},{"$f":"(AG6*$CZ6)","v":0},{"$f":"(AH6*$CZ6)","v":0},{"$f":"(AI6*$CZ6)","v":0},{"$f":"(AJ6*$CZ6)","v":0},{"$f":"(AK6*$CZ6)","v":0},{"$f":"(AL6*$CZ6)","v":0},{"$f":"(AM6*$CZ6)","v":0},{"$f":"(AN6*$CZ6)","v":0},{"$f":"(AO6*$CZ6)","v":0},{"$f":"(AP6*$CZ6)","v":0},{"$f":"(AQ6*$CZ6)","v":0},{"$f":"(AR6*$CZ6)","v":0},{"$f":"(AS6*$CZ6)","v":0},{"$f":"(AT6*$CZ6)","v":0},{"$f":"(AU6*$CZ6)","v":0},{"$f":"(AV6*$CZ6)","v":0},{"$f":"(AW6*$CZ6)","v":0},{"$f":"(AX6*$CZ6)","v":0},{"$f":"(AY6*$CZ6)","v":0},{"$f":"(AZ6*$CZ6)","v":0},{"$f":"(BA6*$CZ6)","v":0},{"$f":"(BB6*$CZ6)","v":0},{"$f":"(BC6*$CZ6)","v":0},{"$f":"(BD6*$CZ6)","v":0},{"$f":"(BE6*$CZ6)","v":0},{"$f":"(BF6*$CZ6)","v":0},{"$f":"(BG6*$CZ6)","v":0},{"$f":"(BH6*$CZ6)","v":0},{"$f":"(BI6*$CZ6)","v":0},{"$f":"(BJ6*$CZ6)","v":0},{"$f":"(BK6*$CZ6)","v":0},{"$f":"(BL6*$CZ6)","v":0},{"$f":"(BM6*$CZ6)","v":0},{"$f":"(BN6*$CZ6)","v":0},{"$f":"(BO6*$CZ6)","v":0},{"$f":"(BP6*$CZ6)","v":0},{"$f":"(BQ6*$CZ6)","v":0},{"$f":"(BR6*$CZ6)","v":0},{"$f":"(BS6*$CZ6)","v":0},{"$f":"(BT6*$CZ6)","v":0},{"$f":"(BU6*$CZ6)","v":0},{"$f":"(BV6*$CZ6)","v":0},{"$f":"(BW6*$CZ6)","v":0},{"$f":"(BX6*$CZ6)","v":0},{"$f":"(BY6*$CZ6)","v":0},{"$f":"(BZ6*$CZ6)","v":0},{"$f":"(CA6*$CZ6)","v":0},{"$f":"(CB6*$CZ6)","v":0},{"$f":"(CC6*$CZ6)","v":0},{"$f":"(CD6*$CZ6)","v":0},{"$f":"(CE6*$CZ6)","v":0},{"$f":"(CF6*$CZ6)","v":0},{"$f":"(CG6*$CZ6)","v":0},{"$f":"(CH6*$CZ6)","v":0},{"$f":"(CI6*$CZ6)","v":0},{"$f":"(CJ6*$CZ6)","v":0},{"$f":"(CK6*$CZ6)","v":0},{"$f":"(CL6*$CZ6)","v":0},{"$f":"(CM6*$CZ6)","v":0},{"$f":"(CN6*$CZ6)","v":0},{"$f":"(CO6*$CZ6)","v":0},{"$f":"(CP6*$CZ6)","v":0},{"$f":"(CQ6*$CZ6)","v":0},{"$f":"(CR6*$CZ6)","v":0},{"$f":"(CS6*$CZ6)","v":0},{"$f":"(CT6*$CZ6)","v":0},{"$f":"(CU6*$CZ6)","v":0},{"$f":"(CV6*$CZ6)","v":0},{"$f":"(CW6*$CZ6)","v":0}]
[null,null,null,null,null,null,null,null,null,null,null,0,0,0,0,0,0,0,0,0,0,0,0,0,0,0,0,0,0,0,0,0,0,0,0,0,0,0,0,0,0,0,0,0,0,0,0,0,0,0,0,0,0,0,0,0,0,0,0,0,0,0,0,0,0,0,0,0,0,0,0,0,0,0,0,0,0,0,0,0,0,0,0,0,0,0,0,0,0,0,0,0,0,0,0,0,0,0,0,0,0,0,{"$f":"SUM(B110:CW110)","v":0},0,0,0,0,0,0,0,0,0,0,0,0,0,0,0,0,0,0,0,0,0,0,0,0,0,0,0,0,0,0,0,0,0,0,0,0,0,0,0,0,0,0,0,0,0,0,0,0,0,0,0,0,0,0,0,0,0,0,0,0,0,0,0,0,0,0,0,0,0,0,0,0,0,0,0,0,0,0,0,0,0,0,0,0,0,0,0,0,0,0,0,0,0,0,0,0,0,0,0,0,0]
["Annual Costs"]
[null,0,0,0,0,0,0,0,0,0,0,0,0,0,0,0,0,0,0,0,0,0,0,0,0,0,0,0,0,0,0,0,0,0,0,0,0,0,0,0,0,0,0,0,0,0,0,0,0,0,0,0,0,0,0,0,0,0,0,0,0,0,0,0,0,0,0,0,0,0,0,0,0,0,0,0,0,0,0,0,0,0,0,0,0,0,0,0,0,0,0,0,0,0,0,0,0,0,0,0,0,0,{"$f":"SUM(B112:CW112)","v":0},1,0,0,0,0,0,0,0,0,0,0,0,0,0,0,0,0,0,0,0,0,0,0,0,0,0,0,0,0,0,0,0,0,0,0,0,0,0,0,0,0,0,0,0,0,0,0,0,0,0,0,0,0,0,0,0,0,0,0,0,0,0,0,0,0,0,0,0,0,0,0,0,0,0,0,0,0,0,0,0,0,0,0,0,0,0,0,0,0,0,0,0,0,0,0,0,0,0,0,0,0]
[null,null,null,null,null,null,null,null,null,null,null,0,0,0,0,0,0,0,0,0,0,0,0,0,0,0,0,0,0,0,0,0,0,0,0,0,0,0,0,0,0,0,0,0,0,0,0,0,0,0,0,0,0,0,0,0,0,0,0,0,0,0,0,0,0,0,0,0,0,0,0,0,0,0,0,0,0,0,0,0,0,0,0,0,0,0,0,0,0,0,0,0,0,0,0,0,0,0,0,0,0,0,0,0,0,0,0,0,0,0,0,0,0,0,0,0,0,0,0,0,0,0,0,0,0,0,0,0,0,0,0,0,0,0,0,0,0,0,0,0,0,0,0,0,0,0,0,0,0,0,0,0,0,0,0,0,0,0,0,0,0,0,0,0,0,0,0,0,0,0,0,0,0,0,0,0,0,0,0,0,0,0,0,0,0,0,0,0,0,0,0,0,0,0,0,0,0,0,0,0,0,0,0,0]
[null,null,null,null,null,null,null,null,null,null,null,0,0,0,0,0,0,0,0,0,0,0,0,0,0,0,0,0,0,0,0,0,0,0,0,0,0,0,0,0,0,0,0,0,0,0,0,0,0,0,0,0,0,0,0,0,0,0,0,0,0,0,0,0,0,0,0,0,0,0,0,0,0,0,0,0,0,0,0,0,0,0,0,0,0,0,0,0,0,0,0,0,0,0,0,0,0,0,0,0,0,0,0,0,0,0,0,0,0,0,0,0,0,0,0,0,0,0,0,0,0,0,0,0,0,0,0,0,0,0,0,0,0,0,0,0,0,0,0,0,0,0,0,0,0,0,0,0,0,0,0,0,0,0,0,0,0,0,0,0,0,0,0,0,0,0,0,0,0,0,0,0,0,0,0,0,0,0,0,0,0,0,0,0,0,0,0,0,0,0,0,0,0,0,0,0,0,0,0,0,0,0,0,0]
["Marginal cost increase in installation of semi ducted fume cupboards over mobile fume cupboards",86.7,86.7,86.7,86.7,86.7,86.7,86.7,86.7,86.7,86.7,86.7,null,null,null,null,null,null,null,null,null,null,0,0,0,0,0,0,0,0,0,0,0,0,0,0,0,0,0,0,0,0,0,0,0,0,0,0,0,0,0,0,0,0,0,0,0,0,0,0,0,0,0,0,0,0,0,0,0,0,0,0,0,0,0,0,0,0,0,0,0,0,0,0,0,0,0,0,0,0,0,0,0,0,0,0,0,0,0,0,0,953.70000000000027,807.74968146750894,1,86.7,86.7,86.7,86.7,86.7,86.7,86.7,86.7,86.7,86.7,86.7,0,0,0,0,0,0,0,0,0,0,0,0,0,0,0,0,0,0,0,0,0,0,0,0,0,0,0,0,0,0,0,0,0,0,0,0,0,0,0,0,0,0,0,0,0,0,0,0,0,0,0,0,0,0,0,0,0,0,0,0,0,0,0,0,0,0,0,0,0,0,0,0,0,0,0,0,0,0,0,0,0,0,0,0,0,0,0,0,0]
[null,null,null,null,null,null,null,null,null,null,null,0,null,null,null,null,null,null,null,null,null,null,0,0,0,0,0,0,0,0,0,0,0,0,0,0,0,0,0,0,0,0,0,0,0,0,0,0,0,0,0,0,0,0,0,0,0,0,0,0,0,0,0,0,0,0,0,0,0,0,0,0,0,0,0,0,0,0,0,0,0,0,0,0,0,0,0,0,0,0,0,0,0,0,0,0,0,0,0,0,0,0,0,0,0,0,0,0,0,0,0,0,0,0,0,0,0,0,0,0,0,0,0,0,0,0,0,0,0,0,0,0,0,0,0,0,0,0,0,0,0,0,0,0,0,0,0,0,0,0,0,0,0,0,0,0,0,0,0,0,0,0,0,0,0,0,0,0,0,0,0,0,0,0,0,0,0,0,0,0,0,0,0,0,0,0,0,0,0,0,0,0,0,0,0,0,0,0,0,0,0,0,0,0]
[null,null,null,null,null,null,null,null,null,null,null,0,null,null,null,null,null,null,null,null,null,null,0,0,0,0,0,0,0,0,0,0,0,0,0,0,0,0,0,0,0,0,0,0,0,0,0,0,0,0,0,0,0,0,0,0,0,0,0,0,0,0,0,0,0,0,0,0,0,0,0,0,0,0,0,0,0,0,0,0,0,0,0,0,0,0,0,0,0,0,0,0,0,0,0,0,0,0,0,0,0,0,0,0,0,0,0,0,0,0,0,0,0,0,0,0,0,0,0,0,0,0,0,0,0,0,0,0,0,0,0,0,0,0,0,0,0,0,0,0,0,0,0,0,0,0,0,0,0,0,0,0,0,0,0,0,0,0,0,0,0,0,0,0,0,0,0,0,0,0,0,0,0,0,0,0,0,0,0,0,0,0,0,0,0,0,0,0,0,0,0,0,0,0,0,0,0,0,0,0,0,0,0,0]
["Maintenance costs of room based systems",{"$f":"Ventilation!F20/1000","v":92.013643636363625},{"$f":"2*B15","v":184.02728727272725},{"$f":"C15+$B$15","v":276.04093090909089},{"$f":"D15+$B$15","v":368.0545745454545},460.06821818181811,552.08186181818178,644.09550545454545,736.10914909090911,828.12279272727278,920.13643636363645,1012.1500800000001,null,null,null,null,null,null,null,null,null,null,0,0,0,0,0,0,0,0,0,0,0,0,0,0,0,0,0,0,0,0,0,0,0,0,0,0,0,0,0,0,0,0,0,0,0,0,0,0,0,0,0,0,0,0,0,0,0,0,0,0,0,0,0,0,0,0,0,0,0,0,0,0,0,0,0,0,0,0,0,0,0,0,0,0,0,0,0,0,0,6072.9004800000012,4849.3281746948023,1,92.013643636363625,184.02728727272725,276.04093090909089,368.0545745454545,460.06821818181811,552.08186181818178,644.09550545454545,736.10914909090911,828.12279272727278,920.13643636363645,1012.1500800000001,0,0,0,0,0,0,0,0,0,0,0,0,0,0,0,0,0,0,0,0,0,0,0,0,0,0,0,0,0,0,0,0,0,0,0,0,0,0,0,0,0,0,0,0,0,0,0,0,0,0,0,0,0,0,0,0,0,0,0,0,0,0,0,0,0,0,0,0,0,0,0,0,0,0,0,0,0,0,0,0,0,0,0,0,0,0,0,0,0]
{"$rows_left_out":164}
{"sheet":"Annuity Rate","index":3,"n_rows":63,"n_cols":9,"rows_kept":63,"cut":false,"hidden":true,"merged":[]}
[null,null,null,null,null,null,1955,5.6117668116109884]
["Time period","t",{"$f":"Instructions!B18","v":10},null,null,null,1956,5.9581591720275009]
["Annuity Rate","At,r",{"$f":"VLOOKUP((C2-1),'EANCB Calculations'!$A1:$F1002,6)","v":8.607686508868186},null,null,null,1957,6.1613619852809576]
[null,null,null,null,null,null,1958,6.3803577632950441]
[null,null,null,null,null,null,1959,6.4382653007506923]
[null,null,null,null,null,null,1960,6.4919613809368393]
[null,null,null,null,null,null,1961,6.6656839933037837]
[null,null,null,null,null,null,1962,6.8815211783657428]
[null,null,null,null,null,null,1963,6.9636445951210266]
[null,null,null,null,null,null,1964,7.1857989660872406]
[null,null,null,null,null,null,1965,7.5648301203423918]
[null,null,null,null,null,null,1966,7.8722665010160151]
[null,null,null,null,null,null,1967,8.0765221785868455]
[null,null,null,null,null,null,1968,8.3702713231345882]
[null,null,null,null,null,null,1969,8.8051042862106357]
{"$rows_left_out":49}
{"sheet":"EANCB Calculations","index":4,"n_rows":1002,"n_cols":6,"rows_kept":1002,"cut":false,"hidden":true,"merged":[]}
[null,"discount rate","years away","(1+r)^n","Discount Factor","Annuity rate"]
[0,0,0,1,{"$f":"1/D2","v":1},{"$f":"E2","v":1}]
[1,1.0349999999999999,1,{"$f":"B3^C3","v":1.0349999999999999},0.96618357487922713,{"$f":"F2+E3","v":1.9661835748792271}]
[2,1.0349999999999999,2,1.0712249999999999,0.93351070036640305,2.8996942752456301]
[3,1.0349999999999999,3,1.1087178749999997,0.90194270566802237,3.8016369809136523]
[4,1.0349999999999999,4,1.1475230006249997,0.87144222769857238,4.6730792086122248]
[5,1.0349999999999999,5,1.1876863056468745,0.84197316685852419,5.5150523754707486]
[6,1.0349999999999999,6,1.2292553263445152,0.81350064430775282,{"$f":"F7+E8","v":6.3285530197785018}]
[7,1.0349999999999999,7,1.2722792627665731,0.78599096068381913,7.1145439804623205]
[8,1.0349999999999999,8,1.3168090369634029,0.75941155621625056,7.8739555366785714]
[9,1.0349999999999999,9,1.3628973532571218,0.73373097218961414,8.607686508868186]
[10,1.0349999999999999,10,1.410598760621121,0.70891881370977217,9.3166053225779581]
[11,1.0349999999999999,11,1.4599697172428603,0.68494571372924851,10.001551036307207]
[12,1.0349999999999999,12,1.5110686573463603,0.66178329828912896,10.663334334596335]
[13,1.0349999999999999,13,1.5639560603534826,0.63940415293635666,11.302738487532691]
{"$rows_left_out":988}
{"sheet":"EANCB Formulae","index":5,"n_rows":38,"n_cols":23,"rows_kept":38,"cut":false,"hidden":true,"merged":[[7,2,7,15],[12,3,12,5],[34,17,34,36],[13,2,16,15],[9,6,12,15],[9,2,9,5],[8,2,8,15],[10,3,11,3],[31,17,31,37],[33,17,33,37],[8,17,8,40],[10,17,11,17],[10,18,11,18],[15,20,16,20],[15,21,16,21],[15,23,16,23],[15,25,16,25],[15,26,16,26],[15,40,16,40],[15,30,16,30],[15,31,16,31],[15,34,16,34],[15,36,16,36],[15,32,16,32]]}
["Key "]
["Present Value of Net Costs to Business","PVNCB"]
["Time period","t"]
["Discount rate","r"]
["Annuity Rate","at,r"]
["Equivalent Annual Net Cost to Business","EANCB"]
[]
[]
[null,null,"One discount rate (Green Book - time period less than or equal 31)"]
[]
[null,null,null,"EANCB","=","PVNCB"]
[null,null,null,null,null,"at,r"]
[null,null,null,"Where at,r is the annuity rate given by:"]
[]
[]
{"$rows_left_out":24}
{"sheet":"Ventilation","index":6,"n_rows":22,"n_cols":10,"rows_kept":22,"cut":false,"hidden":false,"merged":[[4,8,4,13]]}
[]
[]
[null,"Item",null,null,"Cost M2","Average cost of mixing and mhvr systems"]
[]
[null,"A","Current cost of existing central ventilation system using ductwork & AHU  - M2",null,56,null,null,null,"Assumed cheaper than a stack-based classroom ventilation system that would be required to achieve all year round comfort criteria to ISO 7730 with a 100% natural ventilation system"]
[null,"B","Cost of new stand alone ventilations system @ 55m2 classroom. 256l/s air flow duty ",null,null,47.24]
[null,"C","New Build Area  m2/yr",37572]
[null,"D","refurbishment area m2/yr",67680]
[null,"E","percentage of take up of build area - new build ",0.6]
[null,"F","percentage of take up of build area - refurbishment ",0.4]
[]
[]
[null,"H","Extra cost of new vent system (A-B)",null,null,{"$f":"(F6-E5)","v":-8.759999999999998}]
[null,"J","saving on glazing, less extra vent cost -H",null,null,{"$f":"(D11-F13)","v":8.759999999999998}]
[null,"K","New build area (C*E) M2",null,null,{"$f":"(D7*D9)","v":22543.200000000001}]
{"$rows_left_out":8}
{"sheet":"Fume Cupboard costs","index":7,"n_rows":84,"n_cols":27,"rows_kept":84,"cut":false,"hidden":false,"merged":[[38,12,38,14],[46,12,46,14]]}
[]
[]
[]
["(All prices exclude VAT)"]
[]
["Mobile (Filtered) Unit :-"]
[null,null,null,null,null,null,null,null,"£",null,null,null,null,null,null,null,null,null,"Ductwork installer",null,null,null,null,25.87,"All in rate "]
["£3061 to buy",null,null,null,null,null,null,null,3061,null,null,null,null,"Cost of permanent Fume cupboard installation ",null,null,"Comments",null,"Electrician",null,null,null,null,27.7,"All in rate "]
["Extra cost of ventilation system for mobile fume cupboard installation ",null,null,null,null,null,null,null,2000,null,null,null,null,null,null,null,null,null,"Plumber / pipefitter",null,null,null,null,24.71,"All in rate "]
["Docking station",null,null,null,null,null,null,null,324.13]
["Services connections",null,null,null,null,null,null,null,{"$f":"SUM(O53:O56)","v":2049.7916399999999},null,null,null,null,"Description ",null,null,null,null,"Item","QTY","Materials","Mat Ext","Labour constant","labour ext ","labour cost","final cost "]
["Total capital cost",null,null,null,null,null,null,null,{"$f":"SUM(I8:I11)","v":7434.9216400000005}]
["Cost of filter and annual service to replace filter is £500 per every three years",null,null,null,null,null,null,null,500,null,null,null,null,"Fixed Fume Cupboard",2250,null,null,null,"cold water"]
["Cost of annual air flow test £50",null,null,null,null,null,null,null,50,null,null,null,null,"Cold water supply ",{"$f":"Z24","v":1312.34059},null,null,null,"35mm tee",1,13.88,{"$f":"(T14*U14)","v":13.88},0.25,{"$f":"(T14*W14)","v":0.25},{"$f":"(X14*X9)","v":6.1775000000000002},{"$f":"(V14+Y14)","v":20.057500000000001}]
["Cost of annual filter saturation test £150",null,null,null,null,null,null,null,150,null,null,null,null,"Gas Supply ",{"$f":"Z38","v":1148.4414700000002},null,null,null,"35mm-15mm reducer",1,7.66,{"$f":"(T15*U15)","v":7.66},0.34,{"$f":"(T15*W15)","v":0.34},{"$f":"(X15*X9)","v":8.4014000000000006},{"$f":"(V15+Y15)","v":16.061399999999999}]
{"$rows_left_out":70}
{"sheet":"Ventilation detail costs ","index":8,"n_rows":67,"n_cols":19,"rows_kept":67,"cut":false,"hidden":false,"merged":[]}
[]
[null,null,null,null,null,null,null,null,null,null,null,"Ductwork installer",null,null,null,null,25.87,"All in rate "]
[null,null,"Establish cost of stand alone ventilation systems and pro-rata m2 on typical 55m2 class room ",null,null,null,null,null,null,null,null,"Electrician",null,null,null,null,27.7,"All in rate "]
[]
[]
[null,null,"Description ","Mixing Type A","MVHR Type A","Mixing Type B","MVHR Type B","Mixing System Type C","MVHR Type C",null,null,"Item","QTY","Materials","Mat Ext","Labour constant","labour ext ","labour cost","final cost "]
[]
[null,null,"Ventilation unit ",1980,2449,3000,3000,2050,4281.1000000000004]
[null,null,"Install vent unit to ceiling soffit",270,{"$f":"S9","v":74.625100000000003},{"$f":"S9","v":74.625100000000003},{"$f":"S9","v":74.625100000000003},300,{"$f":"S9","v":74.625100000000003},null,null,"install vent unit in classroom, incl all brackets, fixings",1,4,{"$f":"(M9*N9)","v":4},2.73,{"$f":"(M9*P9)","v":2.73},{"$f":"(Q9*Q2)","v":70.625100000000003},{"$f":"(O9+R9)","v":74.625100000000003}]
[null,null,"external weather louvre",160,160,160,160,300,150]
[null,null,"Ductwork sections required for install ","N/A",{"$f":"(S11+S12+S13)","v":250.26439999999999},"N/A","?","N/A","N/A",null,null,"ductwork taper; 1250*450 external grille to 1250 * 345 unit connection. Assume all flanged connections, thermally sealed, ",1,35,{"$f":"(M11*N11)","v":35},2.4700000000000002,{"$f":"(M11*P11)","v":2.4700000000000002},{"$f":"(Q11*Q2)","v":63.898900000000005},{"$f":"(O11+R11)","v":98.898899999999998}]
[null,null,null,null,null,null,null,null,null,null,null,"1240*140 square bend",1,50.15,{"$f":"(M12*N12)","v":50.15},1.69,{"$f":"(M12*P12)","v":1.69},{"$f":"(Q12*Q3)","v":46.812999999999995},{"$f":"(O12+R12)","v":96.962999999999994}]
[null,null,null,null,null,null,null,null,null,null,null,"1240*140 grille",1,35,{"$f":"(M13*N13)","v":35},0.75,{"$f":"(M13*P13)","v":0.75},{"$f":"(Q13*Q2)","v":19.4025},{"$f":"(O13+R13)","v":54.402500000000003}]
[null,null,"fused connection eletrical supply ",{"$f":"($S$14+$S$15)","v":175.173},{"$f":"($S$14+$S$15)","v":175.173},175.173,175.173,175.173,{"$f":"S14+S15","v":175.173},null,null,"FCU Typical MK brand ",1,8,{"$f":"(M14*N14)","v":8},0.49,{"$f":"(M14*P14)","v":0.49},{"$f":"(Q14*Q3)","v":13.572999999999999},{"$f":"(O14+R14)","v":21.573}]
[null,null,null,null,null,null,null,null,null,null,null,"2.5mm twin & earth - assume 150m distance max, subject to cable size and volt drop calculations  ",150,0.47,70.5,0.02,3,{"$f":"(Q15*Q3)","v":83.1},153.6]
{"$rows_left_out":52}